Search found 275 matches

by boberski
Sat Apr 29, 2017 10:49 am
Forum: Current stable release (099)
Topic: mySQL compilation error
Replies: 15
Views: 1407

Re: mySQL compilation error

I will look into that. Turley what you think about log?
by boberski
Fri Apr 28, 2017 12:31 pm
Forum: Current stable release (099)
Topic: mySQL compilation error
Replies: 15
Views: 1407

Re: mySQL compilation error

I use: ./build_linux_release.sh to compile, before I have isntalled all the libs you see, update gcc and cleat cmake cache. Minute before I delete all SQL Libs and install one more time: [root@uo ~]# yum list installed | grep mysql mysql-community-client.x86_64 5.6.36-2.el7 @mysql56-community mysql-...
by boberski
Fri Apr 28, 2017 12:08 pm
Forum: Current stable release (099)
Topic: mySQL compilation error
Replies: 15
Views: 1407

Re: mySQL compilation error

[root@uo ~]# yum list installed | grep mysql mysql-community-client.x86_64 5.6.36-2.el7 @mysql56-community mysql-community-common.x86_64 5.6.36-2.el7 @mysql56-community mysql-community-devel.x86_64 5.6.36-2.el7 @mysql56-community mysql-community-embedded.x86_64 5.6.36-2.el7 @mysql56-community mysql...
by boberski
Fri Apr 28, 2017 10:53 am
Forum: Current stable release (099)
Topic: mySQL compilation error
Replies: 15
Views: 1407

Re: mySQL compilation error

It helped but: Linking CXX executable ../../../bin/pol /usr/bin/ld: cannot find -lmysqlclient collect2: error: ld returned 1 exit status make[2]: *** [../bin/pol] Error 1 make[1]: *** [pol-core/pol/CMakeFiles/pol.dir/all] Error 2 make: *** [all] Error 2 Also: [root@uo ~]# yum install mysql-devel Loa...
by boberski
Fri Apr 28, 2017 3:14 am
Forum: Current stable release (099)
Topic: mySQL compilation error
Replies: 15
Views: 1407

Re: mySQL compilation error

Nando, dir sir can you write a word of wisdom here? :)
by boberski
Wed Apr 26, 2017 11:40 am
Forum: Current stable release (099)
Topic: mySQL compilation error
Replies: 15
Views: 1407

Re: mySQL compilation error

Now I get: [ 87%] Building CXX object pol-core/pol/CMakeFiles/pol.dir/stackcfg.cpp.o /home/ancaria/099-source/pol-core/pol/sqlscrobj.cpp: In member function 'bool Pol::Core::BSQLConnection::query(std::string, Pol::Core::QueryParams)': /home/ancaria/099-source/pol-core/pol/sqlscrobj.cpp:360:94: error...
by boberski
Wed Apr 26, 2017 9:41 am
Forum: Current stable release (099)
Topic: mySQL compilation error
Replies: 15
Views: 1407

Re: mySQL compilation error

I wrote that: I have mysql-devel installed.
by boberski
Wed Apr 26, 2017 2:15 am
Forum: Current stable release (099)
Topic: mySQL compilation error
Replies: 15
Views: 1407

mySQL compilation error

I have strange error on Centos 7 server, It wasynt problem before and now I get it. I have mysql-devel installed. Determining if files mysql/mysql.h exist failed with the following output: Change Dir: /home/ancaria/099-source/pol-core/bin-build/CMakeFiles/CMakeTmp Run Build Command:/usr/bin/gmake "c...
by boberski
Tue Apr 25, 2017 10:11 pm
Forum: Bug Reports & Feature Requests
Topic: TOL as DefaultExpansion - missing code
Replies: 1
Views: 577

Re: TOL as DefaultExpansion - missing code

I think that when I was adding TOL support for core I done this like, when you have default expansion set to TOL and client sends correct package it will stay as it is. But when package is wront it sets expansion to T2A. It will probably we wise to add something to file you posted.
by boberski
Wed Apr 12, 2017 12:42 pm
Forum: Test shard
Topic: Test Shard & more
Replies: 11
Views: 6789

Re: Test Shard & more

Updated TestShard URL, http://pol.uo.hyeah.pl/ also shards host ar now uo.hyeah.pl.
by boberski
Thu Mar 23, 2017 7:05 am
Forum: Development Discussion
Topic: Several issues with the Edwards "Distro" have been fixed
Replies: 7
Views: 1086

Re: Several issues with the Edwards "Distro" have been fixed

I was bugfixing it but as you see I do not catch all of errors.
by boberski
Mon Mar 20, 2017 11:09 pm
Forum: First steps
Topic: Need help with starting pol Linux
Replies: 10
Views: 1263

Re: Need help with starting pol Linux

Do you have distro and done uoconvert on map files?
by boberski
Mon Mar 20, 2017 1:08 pm
Forum: First steps
Topic: Need help with starting pol Linux
Replies: 10
Views: 1263

Re: Need help with starting pol Linux

Code: Select all

chmod 755 pol
by boberski
Mon Mar 20, 2017 11:33 am
Forum: First steps
Topic: Need help with starting pol Linux
Replies: 10
Views: 1263

Re: Need help with starting pol Linux

Code: Select all

./pol
You type this in main POL dir.
by boberski
Mon Mar 20, 2017 11:33 am
Forum: First steps
Topic: Need help with starting pol Linux
Replies: 10
Views: 1263

Re: Need help with starting pol Linux

Code: Select all

./pol
You type this in main POL dir.
by boberski
Fri Mar 10, 2017 6:58 am
Forum: General Discussion
Topic: Hello. I'm back. Well, somewhat...
Replies: 11
Views: 1302

Re: Hello. I'm back. Well, somewhat...

Dude! Welcome back! :)
by boberski
Tue Mar 07, 2017 4:27 am
Forum: General Discussion
Topic: Regarding Yukiko
Replies: 12
Views: 1551

Re: Regarding Yukiko

Any more info?
by boberski
Sun Mar 05, 2017 12:58 pm
Forum: Scripting Help
Topic: Connecting Server Problem
Replies: 3
Views: 503

Re: Connecting Server Problem

What version of POL and distro you are using?
What client version?
Windows on Linux?
by boberski
Wed Feb 22, 2017 4:46 am
Forum: Hello world
Topic: I would like to use a Mondain's Legacy client
Replies: 1
Views: 1293

Re: I would like to use a Mondain's Legacy client

Yes it is :)
I don't know what to write more :P
by boberski
Tue Jan 31, 2017 6:32 am
Forum: Old distros
Topic: Zulu Script Help
Replies: 3
Views: 851

Re: Zulu Script Help

Can you share a solution with us? :)
by boberski
Wed Jan 25, 2017 5:04 am
Forum: Current stable release (099)
Topic: strange builds error
Replies: 17
Views: 1626

Re: strange builds error

Yeap, I have newest commit without any modyfications.
by boberski
Wed Jan 25, 2017 2:23 am
Forum: Current stable release (099)
Topic: strange builds error
Replies: 17
Views: 1626

Re: strange builds error

I done that before every single build.
by boberski
Tue Jan 24, 2017 4:35 pm
Forum: Current stable release (099)
Topic: strange builds error
Replies: 17
Views: 1626

Re: strange builds error

Ok, VS2013 project works well 2015 same as it was, buildDistWin.bat gives me: Extracting boost libraries Nothing to do. Files already extracted. Building Win32-release from "pol-2015.sln"... Building x64-release from "pol-2015.sln"... Something went wrong. Check the logs in the 'dist' folder. Press ...
by boberski
Tue Jan 24, 2017 11:59 am
Forum: Current stable release (099)
Topic: strange builds error
Replies: 17
Views: 1626

Re: strange builds error

Yeap, and everything is the same. Same linking errors as in debug mode.